Jump to content

Gary

Members
  • Content Count

    8
  • Joined

  • Last visited

  • Days Won

    1

Posts posted by Gary


  1. Hi Andy, everything works now :) The problem was with the bad cordova plugin job. I can run the game now. Thank you very very much. Btw yes, I did the deleting confix job like you want to do and still can see the same confix file but the game works now.

    • Like 1

  2. Hi Andy, I tried it and it still does not work. What is weird is that when I see into the config.xml section in cocoon, I can see exactly the same config.xml as previously before the deleting case. Maybe the problem is really the plugins. I have added no plugins into the construct2 game but the app should include inpp purchases and game center by default as it cant have been changed when creating the app in itunes.connect. Should I add plugin for inapps and game center in the game? Another thing is I am using cordova that is added in the construct project during the export and I do not know if I should tick a plugin in the cocoon project related to cordova. When I tried to run the game with no plugins, it did not work as well. 


  3. Hi Andy:

    I did what you advised but it does not work :( (still black screen after the cocoon splash screen appears on my iphone and thats it) Would you be willing to try to launch the app on your own iphone? Maybe the bug is elsewhere. I am sending the cocoon project zip and list of plugins. I added these since when creating a new app in itunes connect, it must contain inapp purchases and game center by default. I am using cordova. I cannot compile the developer app, attached is confix.xml and this is error log of compiling the developer app:

     

    COMPILER ERROR: 
    
    Internal compiler error
    
    CORDOVA LOG: 
    
    eveloper/Xcode/DerivedData/PhysicsTest-easrvqkpnedflpayrfjorgwaoiib/Build/Intermediates/ArchiveIntermediates/PhysicsTest/IntermediateBuildFilesPath/PhysicsTest.build/Release-iphoneos/PhysicsTest.build/Objects-normal/arm64/GCDWebServer.o
        /workspace/platforms/ios/PhysicsTest/Plugins/com.ludei.canvasplus.ios/libCocoon.a(GCDWebServer.o)
    duplicate symbol _OBJC_IVAR_$_GCDWebServer._options in:
        /Library/Developer/Xcode/DerivedData/PhysicsTest-easrvqkpnedflpayrfjorgwaoiib/Build/Intermediates/ArchiveIntermediates/PhysicsTest/IntermediateBuildFilesPath/PhysicsTest.build/Release-iphoneos/PhysicsTest.build/Objects-normal/arm64/GCDWebServer.o
        /workspace/platforms/ios/PhysicsTest/Plugins/com.ludei.canvasplus.ios/libCocoon.a(GCDWebServer.o)
    duplicate symbol _OBJC_IVAR_$_GCDWebServer._port in:
        /Library/Developer/Xcode/DerivedData/PhysicsTest-easrvqkpnedflpayrfjorgwaoiib/Build/Intermediates/ArchiveIntermediates/PhysicsTest/IntermediateBuildFilesPath/PhysicsTest.build/Release-iphoneos/PhysicsTest.build/Objects-normal/arm64/GCDWebServer.o
        /workspace/platforms/ios/PhysicsTest/Plugins/com.ludei.canvasplus.ios/libCocoon.a(GCDWebServer.o)
    duplicate symbol _OBJC_IVAR_$_GCDWebServer._registrationService in:
        /Library/Developer/Xcode/DerivedData/PhysicsTest-easrvqkpnedflpayrfjorgwaoiib/Build/Intermediates/ArchiveIntermediates/PhysicsTest/IntermediateBuildFilesPath/PhysicsTest.build/Release-iphoneos/PhysicsTest.build/Objects-normal/arm64/GCDWebServer.o
        /workspace/platforms/ios/PhysicsTest/Plugins/com.ludei.canvasplus.ios/libCocoon.a(GCDWebServer.o)
    duplicate symbol _OBJC_IVAR_$_GCDWebServer._resolutionService in:
        /Library/Developer/Xcode/DerivedData/PhysicsTest-easrvqkpnedflpayrfjorgwaoiib/Build/Intermediates/ArchiveIntermediates/PhysicsTest/IntermediateBuildFilesPath/PhysicsTest.build/Release-iphoneos/PhysicsTest.build/Objects-normal/arm64/GCDWebServer.o
        /workspace/platforms/ios/PhysicsTest/Plugins/com.ludei.canvasplus.ios/libCocoon.a(GCDWebServer.o)
    duplicate symbol _OBJC_IVAR_$_GCDWebServer._serverName in:
        /U�[32m[2017-09-12 04:52:17.527] [INFO] IOSBuilder - �[39msers/ideateca/Library/Developer/Xcode/DerivedData/PhysicsTest-easrvqkpnedflpayrfjorgwaoiib/Build/Intermediates/ArchiveIntermediates/PhysicsTest/IntermediateBuildFilesPath/PhysicsTest.build/Release-iphoneos/PhysicsTest.build/Objects-normal/arm64/GCDWebServer.o
        /workspace/platforms/ios/PhysicsTest/Plugins/com.ludei.canvasplus.ios/libCocoon.a(GCDWebServer.o)
    duplicate symbol _OBJC_IVAR_$_GCDWebServer._suspendInBackground in:
        /Library/Developer/Xcode/DerivedData/PhysicsTest-easrvqkpnedflpayrfjorgwaoiib/Build/Intermediates/ArchiveIntermediates/PhysicsTest/IntermediateBuildFilesPath/PhysicsTest.build/Release-iphoneos/PhysicsTest.build/Objects-normal/arm64/GCDWebServer.o
        /workspace/platforms/ios/PhysicsTest/Plugins/com.ludei.canvasplus.ios/libCocoon.a(GCDWebServer.o)
    duplicate symbol _OBJC_IVAR_$_GCDWebServer._syncQueue in:
        /Library/Developer/Xcode/DerivedData/PhysicsTest-easrvqkpnedflpayrfjorgwaoiib/Build/Intermediates/ArchiveIntermediates/PhysicsTest/IntermediateBuildFilesPath/PhysicsTest.build/Release-iphoneos/PhysicsTest.build/Objects-normal/arm64/GCDWebServer.o
        /workspace/platforms/ios/PhysicsTest/Plugins/com.ludei.canvasplus.ios/libCocoon.a(GCDWebServer.o)
    duplicate symbol _OBJC_IVAR_$_GCDWebServerHandler._matchBlock in:
        /Library/Developer/Xcode/DerivedData/PhysicsTest-easrvqkpnedflpayrfjorgwaoiib/Build/Intermediates/ArchiveIntermediates/PhysicsTest/IntermediateBuildFilesPath/PhysicsTest.build/Release-iphoneos/PhysicsTest.build/Objects-normal/arm64/GCDWebServer.o
        /workspace/platforms/ios/PhysicsTest/Plugins/com.ludei.canvasplus.ios/libCocoon.a(GCDWebServer.o)
    duplicate symbol _OBJC_METACLASS_$_GCDWebServer in:
        /Library/Developer/Xcode/DerivedData/PhysicsTest-easrvqkpnedflpayrfjorgwaoiib/Build/Intermediates/ArchiveIntermediates/PhysicsTest/IntermediateBuildFilesPath/PhysicsTest.build/Release-iphoneos/PhysicsTest.build/Objects-normal/arm64/GCDWebServer.o
        /workspace/platforms/ios/PhysicsTest/Plugins/com.ludei.canvasplus.ios/libCocoon.a(GCDWebServer.o)
    duplicate symbol _OBJC_METACLASS_$_GCDWebServerHandler in:
        /Library/Developer/Xcode/DerivedData/PhysicsTest-easrvqkpnedflpayrfjorgwaoiib/Build/Intermediates/ArchiveIntermediates/PhysicsTest/IntermediateBuildFilesPath/PhysicsTest.build/Release-iphoneos/PhysicsTest.build/Objects-normal/arm64/GCDWebServer.o
        /workspace/platforms/ios/PhysicsTest/Plugins/com.ludei.canvasplus.ios/libCocoon.a(GCDWebServer.o)
    duplicate symbol _OBJC_CLASS_$_GCDWebServerErrorResponse in:
        /Library/Developer/Xcode/DerivedData/PhysicsTest-easrvqkpnedflpayrfjorgwaoiib/Build/Intermediates/ArchiveIntermediates/PhysicsTest/IntermediateBuildFilesPath/PhysicsTest.build/Release-iphoneos/PhysicsTest.build/Objects-normal/arm64/GCDWebServerErrorResponse.o
        /workspace/platforms/ios/PhysicsTest/Plugins/com.ludei.canvasplus.ios/libCocoon.a(GCDWebServerErrorResponse.o)
    duplicate symbol _OBJC_METACLASS_$_GCDWebServerErrorResponse in:
        /Library/Developer/Xcode/DerivedData/PhysicsTest-easrvqkpnedflpayrfjorgwaoiib/Build/Intermediates/ArchiveIntermediates/PhysicsTest/IntermediateBuildFilesPath/PhysicsTest.build/Release-iphoneos/PhysicsTest.build/Objects-normal/arm64/GCDWebServerErrorResponse.o
        /workspace/platforms/ios/PhysicsTest/Plugins/com.ludei.canvasplus.ios/libCocoon.a(GCDWebServerErrorResponse.o)
    ld: 162 duplicate symbols for architecture arm64
    clang: error: linker command failed with exit code 1 (use -v to see invocation)
    sers/ideateca/Library/Developer/Xcode/DerivedData/PhysicsTest-easrvqkpnedflpayrfjorgwaoiib/Build/Intermediates/ArchiveIntermediates/PhysicsTest/IntermediateBuildFilesPath/PhysicsTest.build/Release-iphoneos/PhysicsTest.build/Objects-normal/arm64/GCDWebServer.o
        /workspace/platforms/ios/PhysicsTest/Plugins/com.ludei.canvasplus.ios/libCocoon.a(GCDWebServer.o)
    duplicate symbol _OBJC_IVAR_$_GCDWebServer._suspendInBackground in:
        /Library/Developer/Xcode/DerivedData/PhysicsTest-easrvqkpnedflpayrfjorgwaoiib/Build/Intermediates/ArchiveIntermediates/PhysicsTest/IntermediateBuildFilesPath/PhysicsTest.build/Release-iphoneos/PhysicsTest.build/Objects-normal/arm64/GCDWebServer.o
        /workspace/platforms/ios/PhysicsTest/Plugins/com.ludei.canvasplus.ios/libCocoon.a(GCDWebServer.o)
    duplicate symbol _OBJC_IVAR_$_GCDWebServer._syncQueue in:
        /Library/Developer/Xcode/DerivedData/PhysicsTest-easrvqkpnedflpayrfjorgwaoiib/Build/Intermediates/ArchiveIntermediates/PhysicsTest/IntermediateBuildFilesPath/PhysicsTest.build/Release-iphoneos/PhysicsTest.build/Objects-normal/arm64/GCDWebServer.o
        /workspace/platforms/ios/PhysicsTest/Plugins/com.ludei.canvasplus.ios/libCocoon.a(GCDWebServer.o)
    duplicate symbol _OBJC_IVAR_$_GCDWebServerHandler._matchBlock in:
        /Library/Developer/Xcode/DerivedData/PhysicsTest-easrvqkpnedflpayrfjorgwaoiib/Build/Intermediates/ArchiveIntermediates/PhysicsTest/IntermediateBuildFilesPath/PhysicsTest.build/Release-iphoneos/PhysicsTest.build/Objects-normal/arm64/GCDWebServer.o
        /workspace/platforms/ios/PhysicsTest/Plugins/com.ludei.canvasplus.ios/libCocoon.a(GCDWebServer.o)
    duplicate symbol _OBJC_METACLASS_$_GCDWebServer in:
        /Library/Developer/Xcode/DerivedData/PhysicsTest-easrvqkpnedflpayrfjorgwaoiib/Build/Intermediates/ArchiveIntermediates/PhysicsTest/IntermediateBuildFilesPath/PhysicsTest.build/Release-iphoneos/PhysicsTest.build/Objects-normal/arm64/GCDWebServer.o
        /workspace/platforms/ios/PhysicsTest/Plugins/com.ludei.canvasplus.ios/libCocoon.a(GCDWebServer.o)
    duplicate symbol _OBJC_METACLASS_$_GCDWebServerHandler in:
        /Library/Developer/Xcode/DerivedData/PhysicsTest-easrvqkpnedflpayrfjorgwaoiib/Build/Intermediates/ArchiveIntermediates/PhysicsTest/IntermediateBuildFilesPath/PhysicsTest.build/Release-iphoneos/PhysicsTest.build/Objects-normal/arm64/GCDWebServer.o
        /workspace/platforms/ios/PhysicsTest/Plugins/com.ludei.canvasplus.ios/libCocoon.a(GCDWebServer.o)
    duplicate symbol _OBJC_CLASS_$_GCDWebServerErrorResponse in:
        /Library/Developer/Xcode/DerivedData/PhysicsTest-easrvqkpnedflpayrfjorgwaoiib/Build/Intermediates/ArchiveIntermediates/PhysicsTest/IntermediateBuildFilesPath/PhysicsTest.build/Release-iphoneos/PhysicsTest.build/Objects-normal/arm64/GCDWebServerErrorResponse.o
        /workspace/platforms/ios/PhysicsTest/Plugins/com.ludei.canvasplus.ios/libCocoon.a(GCDWebServerErrorResponse.o)
    duplicate symbol _OBJC_METACLASS_$_GCDWebServerErrorResponse in:
        /Library/Developer/Xcode/DerivedData/PhysicsTest-easrvqkpnedflpayrfjorgwaoiib/Build/Intermediates/ArchiveIntermediates/PhysicsTest/IntermediateBuildFilesPath/PhysicsTest.build/Release-iphoneos/PhysicsTest.build/Objects-normal/arm64/GCDWebServerErrorResponse.o
        /workspace/platforms/ios/PhysicsTest/Plugins/com.ludei.canvasplus.ios/libCocoon.a(GCDWebServerErrorResponse.o)
    ld: 162 duplicate symbols for architecture arm64
    clang: error: linker command failed with exit code 1 (use -v to see invocation)�[31m[2017-09-12 04:52:17.786] [ERROR] IOSBuilder - �[39m** ARCHIVE FAILED **
    
    
    The following build commands failed:
    ** ARCHIVE FAILED **
    
    
    The following build commands failed:�[31m[2017-09-12 04:52:17.787] [ERROR] IOSBuilder - �[39mLd /Library/Developer/Xcode/DerivedData/PhysicsTest-easrvqkpnedflpayrfjorgwaoiib/Build/Intermediates/ArchiveIntermediates/PhysicsTest/IntermediateBuildFilesPath/PhysicsTest.build/Release-iphoneos/PhysicsTest.build/Objects-normal/arm64/PhysicsTest normal arm64
    (1 failure)
    Ld /Library/Developer/Xcode/DerivedData/PhysicsTest-easrvqkpnedflpayrfjorgwaoiib/Build/Intermediates/ArchiveIntermediates/PhysicsTest/IntermediateBuildFilesPath/PhysicsTest.build/Release-iphoneos/PhysicsTest.build/Objects-normal/arm64/PhysicsTest normal arm64
    (1 failure)�[36m[2017-09-12 04:52:17.832] [DEBUG] IOSBuilder - �[39m[build] clean
    �[36m[2017-09-12 04:52:17.833] [DEBUG] IOSBuilder - �[39m[build] remove keychain
    security: SecKeychainDelete: The specified keychain could not be found.

    coocon.zip

    Screen Shot 2017-09-12 at 13.48.23.png

    Screen Shot 2017-09-12 at 13.47.58.png


  4. Hi Andy,

     

    I tried another app and I can launch it by signing locally but there is the black screen again and I am pretty sure I am using a have installed the right plugins in both cocoon and cocoon project. Do you know what else can cause this problem?

    When I checked my log, the only error was this one: kCLClientRegistrationResultFailedUnavailable

    otherwise everything should be ok but the game cannot launch, only the cocoon logo can

    I think this has to do with the signing problem again.


  5. Hi Andy,

     

    thank you for message, I tried it with no key and the compilation failed again with the same error: 

     

    [36m[2017-08-31 08:26:10.208] [DEBUG] IOSBuilder - [39m[build] remove keychain
    security: SecKeychainDelete: The specified keychain could not be found.
    

  6. Hi, I am using “latest” version of Cocoon, I already tried to change it to the older one for compilation as read this could work but has not. When I am trying to compile iOS app (Construct 2 game), it goes:

    [DEBUG] IOSBuilder - e[39m[build] remove keychain
    security: SecKeychainDelete: The specified keychain could not be found.

    I am using right keychain and provisioning profile since the compilation was successful many times with these two weeks ago and now it stopped working - I did not change anything.

    Can you please tell me what to do?

×
×
  • Create New...

Important Information

By using this site, you agree to our Privacy Policy, Terms of Use, We have placed cookies on your device to help make this website better. You can adjust your cookie settings, otherwise we'll assume you're okay to continue. & Guidelines.